Motion - Support Question 2006x 03x 11x 141352

can't compile motion 3.2.5.1 in a FC2

Question

when trying to compile i've got this message, could someone point me ? TIA

Compiling Motion object files...
--------------------------------------------------------------------------------
gcc -g -O2 -DHAVE_MYSQL -I /usr/include/mysql -DHAVE_PGSQL -I/usr/include -DTYPE_32BIT="int" -DHAVE_BSWAP   -march=athlon -mfpmath=sse -msse  -mmmx -m3dnow -Wall -DVERSION=\"3.2.5.1\" -D_REENTRANT -Dsysconfdir=\"/usr/local/etc\"   -c -o motion.o motion.c
motion.c: In function `motion_loop':
motion.c:1251: error: `time_current_frame' undeclared (first use in this function)
motion.c:1251: error: (Each undeclared identifier is reported only once
motion.c:1251: error: for each function it appears in.)
motion.c:1254: error: `time_last_frame' undeclared (first use in this function)
make: *** [motion.o] Error 1

Environment

Motion version: 3.2.5.1
ffmpeg version:  
Libraries: mysql, postgresql
Server OS: FC2, kernel 2.6.15.4

-- ArielPereira - 11 Mar 2006

Answer

Known bug with fix. See BugReport2006x03x09x012244.

-- KennethLavrsen - 12 Mar 2006
Topic revision: r2 - 12 Mar 2006, KennethLavrsen
Copyright © 1999-2019 by the contributing authors. All material on this collaboration platform is the property of the contributing authors.
Please do not email Kenneth for support questions (read why). Use the Support Requests page or join the Mailing List.
This website only use harmless session cookies. See Cookie Policy for details. By using this website you accept the use of these cookies.